{"text_format":"1","workbook":"xlsx","n_sheets":12,"sheets":["Farm Info","IPM Practices","Link","IPM Plan","Cucurbits","Crucifers, Greens, Herbs","Solanaceae","Root & Bulb","Legume","Maize","Lists","References"],"not_rendered":{"charts":0,"images":3,"macros":1,"external_links":0,"defined_names":38,"comments":0,"pivot_tables":0},"unopened":[],"bounds":{"document_bytes":16777216,"sheet_cells":100000,"rows_first":2000,"rows_last":500,"rows_between":2000,"halvings":0,"cell_chars":16384,"cell_head_chars":4096},"cells_cut":0,"cells_raw":0,"read":"whole","date_system":"1900"}

{"sheet":"Farm Info","index":0,"n_rows":26,"n_cols":6,"rows_kept":26,"cut":false,"hidden":false,"merged":[[5,4,5,8],[6,4,6,8],[5,1,5,2],[6,1,6,2],[18,1,18,2],[15,4,15,9],[16,1,16,2],[18,4,18,9],[17,1,17,2],[0,0,0,9],[2,0,3,9],[25,1,25,2],[11,4,11,8],[25,4,25,8],[19,1,19,2],[23,4,23,9],[17,4,17,9],[19,4,19,9],[15,1,15,2],[23,1,23,2],[9,4,9,8],[10,4,10,8],[9,1,9,2],[12,1,12,2],[12,4,12,8]]}
["Farm Info"]
[]
["Enter Farm Information below in the green boxes and then go to the IPM Practices Tab.  "]
[]
[]
[null,"Farm Name:"]
[null,"Farm Manager:"]
[]
{"$rows_left_out":19}
{"sheet":"IPM Practices","index":1,"n_rows":50,"n_cols":22,"rows_kept":50,"cut":false,"hidden":false,"merged":[[6,0,7,0],[6,1,7,1],[6,2,7,2],[6,3,7,3],[32,2,35,2],[8,4,8,5],[9,4,9,5],[10,4,10,5],[11,4,11,5],[36,2,45,2],[8,2,14,2],[15,2,19,2],[20,2,22,2],[23,2,31,2],[16,4,16,5],[17,4,17,5],[18,4,18,5],[19,4,19,5],[12,4,12,5],[13,4,13,5],[14,4,14,5],[15,4,15,5],[27,4,27,5],[20,4,20,5],[21,4,21,5],[22,4,22,5],[23,4,23,5],[0,0,0,5],[2,0,4,5],[5,4,5,5],[44,4,44,5],[45,4,45,5],[40,4,40,5],[41,4,41,5],[42,4,42,5],[43,4,43,5],[28,4,28,5],[29,4,29,5],[30,4,30,5],[31,4,31,5],[24,4,24,5],[25,4,25,5],[26,4,26,5],[36,4,36,5],[37,4,37,5],[38,4,38,5],[39,4,39,5],[32,4,32,5],[33,4,33,5],[34,4,34,5],[35,4,35,5]]}
["IPM Practices"]
[]
["Select the plant family from the drop down list that appears when you click on the green cell to the right of \"Plant Family\" and then select a crop from the drop down list that appears when clicking on the green block next to \"Crop\".  This will give you specific guidance if any is available regarding practices for this crop.  Check boxes below along the left hand side of the page in the green columns that correspond to practices currently being implemented on the farm (benchmark) or that the producer is willing to begin implementing (planned).  Practices are divided into major areas of Prevention, Avoidance, Monitoring, and Suppression.  After all practices have been selected, go to the IPM Plan tab and click on \"Import Data\" on the upper right hand corner to have the information below automatically pasted to the plan sheet for printing.  Plant Families are also listed in the tabs following the IPM Plan for further information.  References are located on the last tab after the plant families."]
[null,null,null,null,null,null,null,null,null,null,null,null,null,null,null,null,null,null,null,"Crop 1","Crop 2","Crop 3"]
[null,null,null,null,null,null,null,null,null,null,null,null,null,null,null,null,null,null,null,{"$f":"F7","v":"General"},{"$f":"#REF!","v":{"$error":"#REF!"}},{"$f":"#REF!","v":{"$error":"#REF!"}}]
[null,null,null,null,null,null,null,null,null,null,null,null,null,null,null,null,null,null,null,{"$f":"VLOOKUP(T5,Lists!B4:C10,2,FALSE)","v":"General"},{"$f":"VLOOKUP('IPM Practices'!U5,Lists!B4:C10,2,FALSE)","v":{"$error":"#REF!"}},{"$f":"VLOOKUP(V5,Lists!B4:C10,2,FALSE)","v":{"$error":"#REF!"}}]
["Currently Practicing (Benchmark)","Plan on Implementing (Planned)","Principle","Practices","Plant Family:","General",null,null,null,null,null,null,null,null,null,null,null,"Vegetables","Vegetables",{"$f":"F8","v":"Vegetables"},{"$f":"#REF!","v":{"$error":"#REF!"}},{"$f":"#REF!","v":{"$error":"#REF!"}}]
[null,null,null,null,"Crop:","Vegetables",null,null,null,null,null,null,null,null,null,null,null,"Cucumber, Muskmellon, & Watermelon","Musk",{"$f":"VLOOKUP(T7,R7:S33,2,FALSE)","v":"Vegetables"},{"$f":"VLOOKUP(U7,R7:S33,2,FALSE)","v":{"$error":"#REF!"}},{"$f":"VLOOKUP(V7,R7:S33,2,FALSE)","v":{"$error":"#REF!"}}]
{"$rows_left_out":43}
{"sheet":"Link","index":2,"n_rows":52,"n_cols":8,"rows_kept":52,"cut":false,"hidden":true,"merged":[[0,0,0,3],[0,4,0,7]]}
["Benchmark",null,null,null,"Planned"]
[null,"Principle","Practice","Crop 1",null,"Principle","Practice","Crop 1"]
[true,{"$f":"IF(A3=TRUE,\"Prevention\",\"\")","v":"Prevention"},{"$f":"IF(A3=TRUE,'IPM Practices'!D9,\"\")","v":"Use certified pest-free seeds and pest-free transplants where available. (Example:  Purchase certified seed and ensure plants are free of insects, diseases, and weeds before transplanting.)"},{"$f":"IF(A3=TRUE,'IPM Practices'!E9,\"\")","v":"Purchase certified seed and ensure plants are free of insects, diseases, and weeds before transplanting"},false,{"$f":"IF(E3=TRUE,\"Prevention\",\"\")","v":""},{"$f":"IF(E3=TRUE,'IPM Practices'!D9,\"\")","v":""},{"$f":"IF(E3=TRUE,'IPM Practices'!E9,\"\")","v":""}]
[true,"Prevention",{"$f":"IF(A4=TRUE,'IPM Practices'!D10,\"\")","v":"Prevent weeds from going to seed. (Example: Cultivate, pull, mow, flame, etc.)"},{"$f":"IF(A4=TRUE,'IPM Practices'!E10,\"\")","v":"Cultivation, pulling, mowing, flaming, or other means"},false,{"$f":"IF(E4=TRUE,\"Prevention\",\"\")","v":""},{"$f":"IF(E4=TRUE,'IPM Practices'!D10,\"\")","v":""},{"$f":"IF(E4=TRUE,'IPM Practices'!E10,\"\")","v":""}]
[true,"Prevention",{"$f":"IF(A5=TRUE,'IPM Practices'!D11,\"\")","v":"Reduce moisture on plant surfaces to prevent disease incidence.  (Example:  Use drip irrigation or avoid overhead irrigation between 6 p.m. and midnight to minimize disease.)"},{"$f":"IF(A5=TRUE,'IPM Practices'!E11,\"\")","v":"."},false,"",{"$f":"IF(E5=TRUE,'IPM Practices'!D11,\"\")","v":""},{"$f":"IF(E5=TRUE,'IPM Practices'!E11,\"\")","v":""}]
[true,"Prevention",{"$f":"IF(A6=TRUE,'IPM Practices'!D12,\"\")","v":"Employ methods to avoid spreading pests (pathogens, weeds, and insects). (Example: Work crop when dry, work infested fields last, wash equipment between fields, etc.)"},{"$f":"IF(A6=TRUE,'IPM Practices'!E12,\"\")","v":"Working crop when dry, working infested fields last, hosing down equipment between fields, etc."},false,"",{"$f":"IF(E6=TRUE,'IPM Practices'!D12,\"\")","v":""},{"$f":"IF(E6=TRUE,'IPM Practices'!E12,\"\")","v":""}]
[true,"Prevention",{"$f":"IF(A7=TRUE,'IPM Practices'!D13,\"\")","v":"Destroy and/or remove crop residues for field sanitation procedures. Include fall tillage where appropriate to control weeds and break pest cycles. (Example: Plow under corn refuse in the fall to control European corn borer.)"},{"$f":"IF(A7=TRUE,'IPM Practices'!E13,\"\")","v":"See NEVMG for guidance.  Example:  plow-under corn refuse in fall to control European corn borer."},false,"",{"$f":"IF(E7=TRUE,'IPM Practices'!D13,\"\")","v":""},{"$f":"IF(E7=TRUE,'IPM Practices'!E13,\"\")","v":""}]
[true,"Prevention",{"$f":"IF(A8=TRUE,'IPM Practices'!D14,\"\")","v":"Eliminate unmanaged plants that serve as pest reservoirs, such as abandoned crops, volunteers from previous crop, or weed hosts of viruses."},{"$f":"IF(A8=TRUE,'IPM Practices'!E14,\"\")","v":"."},false,"",{"$f":"IF(E8=TRUE,'IPM Practices'!D14,\"\")","v":""},{"$f":"IF(E8=TRUE,'IPM Practices'!E14,\"\")","v":""}]
{"$rows_left_out":45}
{"sheet":"IPM Plan","index":3,"n_rows":82,"n_cols":12,"rows_kept":82,"cut":false,"hidden":false,"merged":[[115,6,115,9],[105,1,105,5],[106,1,106,5],[110,6,110,9],[107,6,107,9],[108,6,108,9],[4,11,6,13],[119,1,119,5],[120,1,120,5],[94,1,94,5],[93,6,93,9],[94,6,94,9],[101,6,101,9],[102,6,102,9],[97,6,97,9],[98,6,98,9],[99,6,99,9],[100,6,100,9],[107,1,107,5],[108,1,108,5],[105,6,105,9],[106,6,106,9],[109,1,109,5],[110,1,110,5],[121,6,121,9],[122,6,122,9],[115,1,115,5],[116,1,116,5],[117,1,117,5],[118,1,118,5],[113,1,113,5],[114,1,114,5],[91,1,91,5],[92,1,92,5],[95,1,95,5],[96,1,96,5],[99,1,99,5],[100,1,100,5],[103,1,103,5],[104,1,104,5],[113,6,113,9],[114,6,114,9],[103,6,103,9],[104,6,104,9],[116,6,116,9],[111,6,111,9],[112,6,112,9],[93,1,93,5],[111,1,111,5],[112,1,112,5],[109,6,109,9],[87,6,87,9],[88,6,88,9],[87,1,87,5],[88,1,88,5],[89,6,89,9],[90,6,90,9],[86,6,86,9],[81,6,81,9],[82,6,82,9],[83,6,83,9],[84,6,84,9],[83,1,83,5],[84,1,84,5],[86,1,86,5],[75,6,75,9],[76,6,76,9],[77,6,77,9],[81,1,81,5],[82,1,82,5],[85,6,85,9],[85,1,85,5],[69,6,69,9],[70,6,70,9],[71,6,71,9],[72,6,72,9],[73,6,73,9],[74,6,74,9],[78,0,78,9],[79,1,79,8],[80,6,80,9],[80,1,80,5],[63,6,63,9],[64,6,64,9],[65,6,65,9],[66,6,66,9],[67,6,67,9],[68,6,68,9],[57,6,57,9],[58,6,58,9],[59,6,59,9],[60,6,60,9],[61,6,61,9],[62,6,62,9],[51,6,51,9],[52,6,52,9],[53,6,53,9],[54,6,54,9],[55,6,55,9],[56,6,56,9],[45,6,45,9],[46,6,46,9],[47,6,47,9],[48,6,48,9],[49,6,49,9],[50,6,50,9],[39,6,39,9],[40,6,40,9],[41,6,41,9],[42,6,42,9],[43,6,43,9],[44,6,44,9],[77,1,77,5],[30,6,30,9],[31,6,31,9],[32,6,32,9],[33,6,33,9],[34,6,34,9],[35,6,35,9],[36,6,36,9],[37,6,37,9],[38,6,38,9],[71,1,71,5],[72,1,72,5],[73,1,73,5],[74,1,74,5],[75,1,75,5],[76,1,76,5],[65,1,65,5],[66,1,66,5],[67,1,67,5],[68,1,68,5],[69,1,69,5],[70,1,70,5],[59,1,59,5],[60,1,60,5],[61,1,61,5],[62,1,62,5],[63,1,63,5],[64,1,64,5],[53,1,53,5],[54,1,54,5],[55,1,55,5],[56,1,56,5],[57,1,57,5],[58,1,58,5],[47,1,47,5],[48,1,48,5],[49,1,49,5],[50,1,50,5],[51,1,51,5],[52,1,52,5],[41,1,41,5],[42,1,42,5],[43,1,43,5],[44,1,44,5],[45,1,45,5],[46,1,46,5],[35,1,35,5],[36,1,36,5],[37,1,37,5],[38,1,38,5],[39,1,39,5],[40,1,40,5],[31,1,31,5],[32,1,32,5],[33,1,33,5],[34,1,34,5],[26,1,26,8],[28,0,28,9],[23,2,23,3],[14,4,14,9],[29,1,29,8],[25,1,25,3],[25,4,25,5],[124,1,124,5],[125,1,125,5],[0,0,0,9],[1,4,1,8],[2,4,2,8],[3,4,3,8],[4,4,4,8],[5,4,5,8],[6,4,6,8],[22,2,22,3],[19,1,20,1],[9,4,9,9],[13,4,13,9],[15,4,15,9],[11,4,11,9],[19,2,20,3],[16,0,16,9],[18,1,18,9],[19,4,20,4],[19,5,20,5],[19,6,19,8],[21,2,21,3],[8,4,8,8],[30,1,30,5],[126,1,126,5],[89,1,89,5],[125,6,125,9],[126,6,126,9],[127,6,127,9],[117,6,117,9],[118,6,118,9],[119,6,119,9],[120,6,120,9],[123,6,123,9],[90,1,90,5],[101,1,101,5],[102,1,102,5],[97,1,97,5],[98,1,98,5],[124,6,124,9],[91,6,91,9],[92,6,92,9],[95,6,95,9],[96,6,96,9],[127,1,127,5],[121,1,121,5],[122,1,122,5],[123,1,123,5]]}
["Intensive Vegetable IPM Plan"]
[null,null,"Farm Name:",null,{"$f":"IF('Farm Info'!E6:I6=\"\",\"\",'Farm Info'!E6:I6)","v":""}]
[null,null,"Farm Manager:",null,{"$f":"IF('Farm Info'!E7:I7=\"\",\"\",'Farm Info'!E7:I7)","v":""}]
[null,null,"Contact Address:",null,{"$f":"IF('Farm Info'!E10:I10=\"\",\"\",'Farm Info'!E10:I10)","v":""}]
[null,null,null,null,{"$f":"IF('Farm Info'!E11:I11=\"\",\"\",'Farm Info'!E11:I11)","v":""},null,null,null,null,null,null,"Use the print button after clicking the import Data button above"]
[null,null,null,null,{"$f":"IF('Farm Info'!E12:I12=\"\",\"\",'Farm Info'!E12:I12)","v":""}]
[null,null,"Contact Phone:",null,{"$f":"IF('Farm Info'!E13:I13=\"\",\"\",'Farm Info'!E13:I13)","v":""}]
[]
{"$rows_left_out":75}
{"sheet":"Cucurbits","index":4,"n_rows":54,"n_cols":5,"rows_kept":54,"cut":false,"hidden":false,"merged":[[32,0,35,0],[36,0,45,0],[8,0,14,0],[15,0,19,0],[20,0,22,0],[23,0,31,0]]}
["Cucurbits"]
[]
[null,"Common Roots and Bulbs",null,"Cucumber, Muskmelon, and Watermelon","Pumpkin, Squash, Gourds"]
[null,"Major Pests",null,"Aphids, striped and spotted cucumber beetles, flea beetle, two-spotted spider mite, seedcorn maggot, squash bug, squash vine borer (SVB), whiteflies","Aphids, striped and spotted cucumber beetles, cutworms, seedcorn maggot, two-spotted spider mite, squash bug, squash vine borer (SVB), slugs, whiteflies"]
[null,"Major Diseases",null,"Angular leaf spot, anthracnose, Alternaria leaf spot, black rot, bacterial wilt, cucumber mosaic virus (CMV), downey mildew (Pseudoperonospora cubensis), Phytophthora blight, fruit rot, powdery mildew, watermelon mosaic virus (WMV), papaya ringspot virsu (PRSV-W), zucchini yellow mosaic virus (ZYMV), seed decay","Powdery mildew, Plectosporium blight, downey mildew, anthracnose, scab, black rot, angular leaf spot, bacterial wilt, Phytophthora blight, fruit rot, post-harvest fruit rot (various fungi)"]
[null,"Disorders"]
[]
["Principle","Practices","General","Cucumber, Muskmelon, and Watermelon","Pumpkin, Squash, Gourds"]
{"$rows_left_out":47}
{"sheet":"Crucifers, Greens, Herbs","index":5,"n_rows":54,"n_cols":7,"rows_kept":54,"cut":false,"hidden":false,"merged":[[36,0,45,0],[32,0,35,0],[23,0,31,0],[0,0,0,2],[8,0,14,0],[15,0,19,0],[20,0,22,0],[3,2,3,3],[4,2,4,3]]}
["Crucifers, Greens, and Herbs"]
[]
[null,"Common Crucifers","Cabbage, Broccoli, Cauliflower","Brussel Sprouts, Chinese Cabbage, Collards, Kohrabi, Mustard, Kale","Lettuce, Endive, Escarole","Mesclun","Spinach"]
[null,"Major Pests","Cabbage aphid, cabbage looper (CL), diamondback moth (DBM), imported cabbageworm (ICW), cabbage root maggot fly, cutworm, flea beetle, leaf miners, onion thrips, slugs, Swede midge, whiteflies",null,"Aphids,cabbage looper, cutworms, leafhopper, tarnished plant bug, leafminer, slugs, whiteflies","Aphids, whiteflies, cabbage looper, cutworms, flea beetles, leafminers, DBM, ICW","Aphids (green peach aphid), leafminers, blister beetles, cabbage looper, fall armyworm"]
[null,"Major Diseases","Alternaria damping off, Alternaria leaf & head rot, black leg, black rot, club root, downey mildew, Fusarium yellows, seed decay, wire stem, turnip mosaic virus",null,"Gray mold (Botrytis), bottom rot (Rhizoctonia), drop, white mold (Sclerotinia minor), Septoria leaf spot, downey mildew, lettuce and cucumber mosaic viruses, seed decay, yellows","Downey mildew,  Rhizoctonia ","Blight (cucumber mosaic virus), downey mildew, seed decay, white rust"]
[null,"Disorders","Oedema of cabbage, head rot & brown beading (broccoli)",null,"Tip burn "]
[]
["Principle","Practices","Cabbage, Broccolli, Cauliflower","Brussel Sprouts, Chinese Cabbage, Collards, Kohrabi, Mustard, Kale","Lettuce, Endive, Escarole","Mesclun","Spinach"]
{"$rows_left_out":47}
{"sheet":"Solanaceae","index":6,"n_rows":54,"n_cols":7,"rows_kept":54,"cut":false,"hidden":false,"merged":[[36,0,45,0],[32,0,35,0],[0,0,0,2],[8,0,14,0],[15,0,19,0],[20,0,22,0],[23,0,31,0]]}
["Solanaceae"]
[]
[null,"Common Solanaceae:","Okra","Eggplant","Pepper","Potato","Tomato"]
[null,"Major Pests:","Aphids, corn earworm, Japanese beetles, two-spotted spider mite (TSSM), stink bugs, nematodes","Aphids, blister beetles, Colorado potato beetle CPB), cutworms, flea beetles, leafhoppers (especially potato leafhopper), two-spotted spider mite (TSSM), tarnished plant bug, tomato fruit worm, pepper maggot, whiteflies","Aphids, whiteflies, Colorado potato beetle (CPB), cutworms, European corn borer (ECB), other caterpillars, fall armyworm, hornworms, leafminers, thrips, mites, pepper maggot","Aphids (green peach,buckthorn, potato), Colorado potato beetle (CPB), cutworms, European corn borer (ECB), flea beetles, potato leafhopper, wireworms \nWeeds:  Yellow nutsedge, quackgrass, barnyard, lambs quarter, nightshade, red rooted pig weed","Aphids, cabbage looper (CL), tomato fruitworm (TFW), tomato/tobacco hornworms (THW), Colorado potato beetle (CPB), cutworms, flea beetles, leafminers, slugs, stink bugs, two-spotted spider mite, whiteflies"]
[null,"Major Diseases:","Damping-off, Fusarium & Verticillium wilts, fruit rot (Choanephora)","Anthracnose, damping-off, Verticillium wilt ","Bacterial spot (Xanthomonas), cucumber mosaic virus (CMV), damping-off, seed decay, Phytophthora crown rot and blight, sunscald, tobacco and mosaic tomato virus (TMV, TOMMV), tomato spotted wilt virus (TSWV)","Early blight (Alternaria), late blight (Phytophthora), common scab (Streptomyces), Pythium leak, Verticillium & Fusarium wilt, potato leaf roll virus (PLRV), potato viruses:  S (PVS), A (PVA), X (PVX), Y (PVY rugose mosaic)","Grey mold (Botrytis), leaf spots: early blight (alternaria & Septora leafspot, anthracnose (Colletotrichium species), late blight (Phytophthora infestans), powdery mildew, white mold, Sclerotinia blight (Sclerotinia species), Phytophthora blight and fruit rot (P. capsici & Pythium species), seed decay, damping-off, bacterial canker, bacterial speck, bacterial spot, cucumber mosaic virus (CMV), tobacco & tomato mosiac virus (TMV, TOMMV), tomato spotted wilt virus (TSWV), Fusarium & Verticillium wilt"]
[null,"Disorders:",null,null,null,null,"Blossom end rot, blotchy ripening, greywall, fruit cracking "]
[]
["Principle","Practices","Okra","Eggplant","Pepper","Potato","Tomato"]
{"$rows_left_out":47}
{"sheet":"Root & Bulb","index":7,"n_rows":54,"n_cols":12,"rows_kept":54,"cut":false,"hidden":false,"merged":[[36,0,45,0],[32,0,35,0],[0,0,0,2],[8,0,14,0],[15,0,19,0],[20,0,22,0],[23,0,31,0]]}
["Root & Bulb Family"]
[]
[null,"Common Root & Bulb Family:","Asparagus","Beet & Swiss Chard","Carrot & Parsnip","Garlic","Leek","Onion","Radish","Celery","Rutabaga & Turnip","Sweet Potato"]
[null,"Major Pests:","Asparagus aphids, asparagus miner, cutworms, asparagus beetle/ Japanese beetle","Aphids, leafminers, margined blister beetle (most common blister beetle), cabbage maggot, flea beetles, leafhoppers, slugs","Carrot rust fly, carrot weevil, cutworms, leafhoppers","Onion thrips","Onion thrips","Cutworms, mites, onion maggot, onion thrips","Cabbage maggot, cutworms, flea beetle","Cabbage looper, imported cabbageworm, green peach aphid, leafminers, mites, tarnished plant bug","Flea beetles, leafminers, aphids, cabbage maggot","Aphids, cutworms, flea beetles, tortoise beetle, grubs, wireworms, slugs, whiteflies"]
[null,"Major Diseases:","Crown rot, rust, botrytis blight","Leaf spots, blights, downy mildew","Leaf blight (cercospora, septoria, or alternaria), Xanthomonas leaf blight, root-knot nematode, parsnip blight, aster yellows, sore head (parsnip only), root & crown rot","Damping-off (Pythium), seed rot (Rhizoctonia), downey mildew, purple blotch, white rot, Fusarium, Penicillium, Botrytis rot","Damping-off (Pythium), seed rot (Rhizoctonia), downey mildew, purple blotch, white rot, ","Botrytis leaf blight, neck rot (Botrytis), downy mildew (Peronospora), Purple Blotch (Alternaria porri, Stemphylium vesicarium)","Seed decay, Alternaria leaf spot, downy mildew, white rust, white blister","Leaf blight (Cercospora, Septoria), basal stalk rot (Rhizoctonia)","Leaf spots (Alternaria & Cercospora), black leg (Phoma leaf spot & canker), seed decay, damping off (turnip only), white rust, white blister","Rhizoctonia root rot, stem canker, black rot"]
[null,"Disorders:",null,null,null,null,null,null,null,"Blackheart"]
[]
["Principle","Practices"," Asparagus","Beets & Swiss Chard","Carrot & Parsnip","Garlic","Leek","Onion","Radish","Celery","Rutabaga & Turnip","Sweet Potato"]
{"$rows_left_out":47}
{"sheet":"Legume","index":8,"n_rows":54,"n_cols":4,"rows_kept":54,"cut":false,"hidden":false,"merged":[[23,0,31,0],[32,0,35,0],[36,0,45,0],[0,0,0,1],[8,0,14,0],[15,0,19,0],[20,0,22,0]]}
["Legume"]
[]
[null,"Common Roots and Bulbs","Snap, Dry, & Lima Beans","Pea"]
[null,"Major Pests","Aphids, cutworms, European corn borer (ECB), corn earworm (CEW), cabbage looper (CL), garden springtail, leafhoppers, Mexican bean beetle, seedcorn maggot, two-spotted spider mite, slugs ","Corn earworm (CEW), fall armyworm, cutworms, pea aphid, seed maggots"]
[null,"Major Diseases","Anthracnose, downey mildew, bacterial blights, bean common mosaic virus (BCMV), bean yellow mosaic virus (BYMV), rust, seed decay, white mold","Damping-off, seed decay, root rot, stem canker"]
[null,"Disorders"]
[]
["Principle","Practices","Examples: Snap, Dry, & Lima","Examples: Pea"]
{"$rows_left_out":47}
{"sheet":"Maize","index":9,"n_rows":54,"n_cols":4,"rows_kept":54,"cut":false,"hidden":false,"merged":[[36,0,45,0],[32,0,35,0],[20,0,22,0],[8,0,14,0],[15,0,19,0],[23,0,31,0]]}
["Maize"]
[]
[null,"Common Roots and Bulbs","Sweet Corn"]
[null,"Major Pests","European corn borer (ECB), common and fall armyworm, corn earworm (CEW), corn flea beetles, corn leaf aphid (CLA), cutworms, seedcorn maggot, wireworms, two-spotted spider mite, Japanese beetle, common stalk borer, sap and picnic beetles, white grub"]
[null,"Major Diseases","Rust, maize dwarf mosaic virus (MDMV), seed decay, Stewart's wilt (Pantoae [Erwinia] stewartii), common smut"]
[null,"Disorders"]
[]
["Principle","Practices","Sweet Corn"]
{"$rows_left_out":47}
{"sheet":"Lists","index":10,"n_rows":21,"n_cols":9,"rows_kept":21,"cut":false,"hidden":true,"merged":[[51,5,54,5],[55,5,66,5],[27,5,33,5],[34,5,38,5],[39,5,41,5],[42,5,50,5]]}
[]
[null,"Plant Families","Column1",null,"Maize"]
[null,null,null,null,null,null,"Legume",null,"Root & Bulb"]
[null,"Cucurbits","Cucurbits"]
[null,"Crucifers, Greens, & Herbs","Crucifers",null,"Sweet Corn",null,"Bean, Snap, Dry, & Lima",null,"Beet & Swiss Chard"]
[null,"Solanaceae","Solanaceae",null,"General",null,"Pea",null,"Asparagus"]
[null,"Root & Bulb","Root",null,null,null,"General",null,"Carrot & Parsnip"]
[null,"Legume","Legume",null,null,null,null,null,"Garlic"]
{"$rows_left_out":14}
{"sheet":"References","index":11,"n_rows":143,"n_cols":1,"rows_kept":143,"cut":false,"hidden":false,"merged":[]}
["Maine IPM Practices for Vegetable Production"]
["Resource List"]
[]
["IPM Guidelines and Elements "]
[]
["1.   Howell, J.C., A.R. Bonanno, T.J. Boucher, R.L. Wick, R. Hazzard, & B. Dicklow.  New England Vegetable Management Guide 2008-2009.  [Hard copies available from UMCE Highmoor Farm: 207-933-2100 or University of Massachusetts Outreach Bookstore: 413-545-2717]"]
["http://www.nevegetable.org/"]
[]
{"$rows_left_out":135}